Sina Hashemi 1 سال قبل

ببخشید وقتی که میخام برنامه رو اجرا کنم این ارور رو نشون میده در حالی که فیلتر شکن روشنه و درست هم کار میکنه:

Launching lib\main.dart on AOSP on IA Emulator in debug mode…
Running Gradle task ‘assembleDebug’…
FAILURE: Build failed with an exception.
* What went wrong:
Could not initialize class org.codehaus.groovy.runtime.InvokerHelper
* Try:
Run with –stacktrace option to get the stack trace. Run with –info or –debug option to get more log output. Run with –scan to get full insights.
* Get more help at https://help.gradle.org
BUILD FAILED in 4s
Exception: Gradle task assembleDebug failed with exit code 1